Target
Serine/threonine-protein kinase Chk1
Ligand
BDBM50335684
Substrate
Meas. Tech.
ChEMBL_714872 (CHEMBL1663818)
IC50
190±n/a nM
Citation
 Caldwell, JJWelsh, EJMatijssen, CAnderson, VEAntoni, LBoxall, KUrban, FHayes, ARaynaud, FIRigoreau, LJRaynham, TAherne, GWPearl, LHOliver, AWGarrett, MDCollins, I Structure-based design of potent and selective 2-(quinazolin-2-yl)phenol inhibitors of checkpoint kinase 2. J Med Chem 54:580-90 (2011)  
Target
Name:
Serine/threonine-protein kinase Chk1
Synonyms:
CHEK1 CHK1 checkpoint homolog Checkpoint kinase-1 (CHK1)
Type:
Enzyme Catalytic Domain
Mol. Mass.:
54443.02
Organism:
Homo sapiens (Human)
Description:
gi_166295192
Residue:
476
  
Inhibitor
Name:
BDBM50335684
Synonyms:
4-FLUORO-2-(4-{[(3S,4R)-4-(1-HYDROXY-1-METHYLETHYL)PYRROLIDIN-3-YL]AMINO}-6,7-DIMETHOXYQUINAZOLIN-2-YL)PHENOL CHEMBL1236782
Type:
Small organic molecule
Emp. Form.:
C23H27FN4O4
Mol. Mass.:
442.4833
SMILES:
COc1cc2nc(nc(N[C@@H]3CNC[C@H]3C(C)(C)O)c2cc1OC)-c1cc(F)ccc1O
: