Target
Adenosine receptor A3
Ligand
BDBM50157672
Substrate
Meas. Tech.
ChEMBL_715074 (CHEMBL1664180)
Ki
45.5±n/a nM
Citation
 Yaziji, VRodríguez, DGutiérrez-de-Terán, HCoelho, ACaamaño, OGarcía-Mera, XBrea, JLoza, MICadavid, MISotelo, E Pyrimidine derivatives as potent and selective A3 adenosine receptor antagonists. J Med Chem 54:457-71 (2011)  
Target
Name:
Adenosine receptor A3
Synonyms:
A3 adenosine receptor (hA3) ADORA3 | Adenosine A3 receptor (A3AR)
Type:
G Protein-Coupled Receptor (GPCR)
Mol. Mass.:
36197.32
Organism:
Homo sapiens (Human)
Description:
P0DMS8
Residue:
318
  
Inhibitor
Name:
BDBM50157672
Synonyms:
CHEMBL222474 | N-(2,6-diphenylpyrimidin-4-yl)propionamide
Type:
Small organic molecule
Emp. Form.:
C19H17N3O
Mol. Mass.:
303.3578
SMILES:
CCC(=O)Nc1cc(nc(n1)-c1ccccc1)-c1ccccc1
: