Target
Adenosine receptor A1
Ligand
BDBM50157672
Substrate
Meas. Tech.
ChEMBL_715069 (CHEMBL1664119)
Ki
22.3±n/a nM
Citation
 Yaziji, VRodríguez, DGutiérrez-de-Terán, HCoelho, ACaamaño, OGarcía-Mera, XBrea, JLoza, MICadavid, MISotelo, E Pyrimidine derivatives as potent and selective A3 adenosine receptor antagonists. J Med Chem 54:457-71 (2011)  
Target
Name:
Adenosine receptor A1
Synonyms:
A1 adenosine receptor (hA1) AA1R_HUMAN ADORA1 Adenosine A1-receptor Adenosine receptor A1 (hA1) | Adenosine transporter (AdT)
Type:
G Protein-Coupled Receptor (GPCR)
Mol. Mass.:
36520.92
Organism:
Homo sapiens (Human)
Description:
P30542
Residue:
326
  
Inhibitor
Name:
BDBM50157672
Synonyms:
CHEMBL222474 | N-(2,6-diphenylpyrimidin-4-yl)propionamide
Type:
Small organic molecule
Emp. Form.:
C19H17N3O
Mol. Mass.:
303.3578
SMILES:
CCC(=O)Nc1cc(nc(n1)-c1ccccc1)-c1ccccc1
: