Target
Tyrosine-protein phosphatase non-receptor type 22
Ligand
BDBM50335881
Substrate
Meas. Tech.
ChEMBL_715337 (CHEMBL1664624)
IC50
970±n/a nM
Citation
 Vang, TXie, YLiu, WHVidovic, DLiu, YWu, SSmith, DHRinderspacher, AChung, CGong, GMustelin, TLandry, DWRickert, RCSchürer, SCDeng, SXTautz, L Inhibition of lymphoid tyrosine phosphatase by benzofuran salicylic acids. J Med Chem 54:562-71 (2011)  
Target
Name:
Tyrosine-protein phosphatase non-receptor type 22
Synonyms:
3.1.3.48 LyP Lymphoid phosphatase (Lyp) PEST-domain phosphatase PTPN22 Tyrosine-protein phosphatase non-receptor type 22 (LYP) | tyrosine-protein phosphatase non-receptor type 22 isoform 1
Type:
Mol. Mass.:
91712.31
Organism:
Homo sapiens (Human)
Description:
Q9Y2R2
Residue:
807
  
Inhibitor
Name:
BDBM50335881
Synonyms:
3-(1-(4-(benzylamino)-4-oxobutyl)-1H-1,2,3-triazol-4-yl)-6-hydroxy-2-para-tolylbenzofuran-5-carboxylic acid | CHEMBL1650904
Type:
Small organic molecule
Emp. Form.:
C29H26N4O5
Mol. Mass.:
510.5405
SMILES:
Cc1ccc(cc1)-c1oc2cc(O)c(cc2c1-c1cn(CCCC(=O)NCc2ccccc2)nn1)C(O)=O
: