Target
Inhibitor of nuclear factor kappa-B kinase subunit beta
Ligand
BDBM50336199
Substrate
Meas. Tech.
ChEMBL_716440 (CHEMBL1670064)
IC50
1±n/a nM
Citation
 Xie, JPoda, GIHu, YChen, NXHeier, RFWolfson, SGReding, MTLennon, PJKurumbail, RGSelness, SRLi, XKishore, NNSommers, CDChristine, LBonar, SLVenkatraman, NMathialagan, SBrustkern, SJHuang, HC Aminopyridinecarboxamide-based inhaled IKK-2 inhibitors for asthma and COPD: Structure-activity relationship. Bioorg Med Chem 19:1242-55 (2011)  
Target
Name:
Inhibitor of nuclear factor kappa-B kinase subunit beta
Synonyms:
I-kappa-B Kinase 2 (IKK-beta) I-kappa-B-kinase beta IKBKB IKK-beta IKK2/IKK1 IKKB_HUMAN Inhibitor of nuclear factor kappa B kinase beta subunit Nuclear factor NF-kappa-B inhibitor kinase beta
Type:
Serine/threonine-protein kinase
Mol. Mass.:
86554.39
Organism:
Homo sapiens (Human)
Description:
GST-tagged IKK-2 was expressed in High Five cells and purified.
Residue:
756
  
Inhibitor
Name:
BDBM50336199
Synonyms:
8-[(5-Chloro-2-{4-[(1-{2-[(2-hydroxyethyl)amino]-2-oxoethyl}-1H-pyrazol-4-yl)methyl]piperazin-1-yl}isonicotinoyl)amino]-1-(4-fluorophenyl)-4,5-dihydro-1H-benzo[g]indazole-3-carboxamide | CHEMBL1669605
Type:
Small organic molecule
Emp. Form.:
C36H36ClFN10O4
Mol. Mass.:
727.187
SMILES:
NC(=O)c1nn(c-2c1CCc1ccc(NC(=O)c3cc(ncc3Cl)N3CCN(Cc4cnn(CC(=O)NCCO)c4)CC3)cc-21)-c1ccc(F)cc1
: