Target
Histone deacetylase 4
Ligand
BDBM19130
Substrate
Meas. Tech.
ChEMBL_716693 (CHEMBL1670518)
IC50
7690±n/a nM
Citation
 Choi, ELee, CPark, JESeo, JJCho, MKang, JSKim, HMPark, SKLee, KHan, G Structure and property based design, synthesis and biological evaluation of¿-lactam based HDAC inhibitors. Bioorg Med Chem Lett 21:1218-21 (2011)  
Target
Name:
Histone deacetylase 4
Synonyms:
Cereblon/Histone deacetylase 4 HDAC4 Histone acetylase 4(HDAC4) KIAA0288
Type:
Enzyme
Mol. Mass.:
119049.39
Organism:
Homo sapiens (Human)
Description:
P56524
Residue:
1084
  
Inhibitor
Name:
BDBM19130
Synonyms:
(2E,4E,6R)-7-[4-(dimethylamino)phenyl]-N-hydroxy-4,6-dimethyl-7-oxohepta-2,4-dienamide TSA | Trichostatin A (TSA)
Type:
Small organic molecule
Emp. Form.:
C17H22N2O3
Mol. Mass.:
302.3682
SMILES:
CC(C=CC(=O)NO)C=C(C)C(=O)c1ccc(cc1)N(C)C
: