Target
C-C chemokine receptor type 5
Ligand
BDBM50198939
Substrate
Meas. Tech.
ChEMBL_716713 (CHEMBL1670538)
IC50
84±n/a nM
Citation
 Nishizawa, RNishiyama, THisaichi, KMinamoto, CMatsunaga, NTakaoka, YNakai, HJenkinson, SKazmierski, WMTada, HSagawa, KShibayama, SFukushima, DMaeda, KMitsuya, H Spirodiketopiperazine-based CCR5 antagonist: discovery of an antiretroviral drug candidate. Bioorg Med Chem Lett 21:1141-5 (2011)  
Target
Name:
C-C chemokine receptor type 5
Synonyms:
C-C CKR-5 CC-CKR-5 CCR5 CCR5_HUMAN CHEMR13 HIV-1 fusion coreceptor
Type:
Enzyme
Mol. Mass.:
40540.21
Organism:
Homo sapiens (Human)
Description:
P51681
Residue:
352
  
Inhibitor
Name:
BDBM50198939
Synonyms:
(R)-1-butyl-3-((R)-1-hydroxy-2-methyl-propyl)-9-(4-phenoxy-benzyl)-1,4,9-triaza-spiro[5.5]undecane-2,5-dione hydrochloride | CHEMBL559168
Type:
Small organic molecule
Emp. Form.:
C29H39N3O4
Mol. Mass.:
493.6377
SMILES:
CCCCN1C(=O)[C@H](NC(=O)C11CCN(Cc2ccc(Oc3ccccc3)cc2)CC1)[C@H](O)C(C)C
: