Target
Carbonic anhydrase 9
Ligand
BDBM26187
Substrate
Meas. Tech.
ChEMBL_716904 (CHEMBL1670883)
Ki
8800±n/a nM
Citation
 Durdagi, SSentürk, MEkinci, DBalaydin, HTGöksu, SKüfrevioglu, ÖIInnocenti, AScozzafava, ASupuran, CT Kinetic and docking studies of phenol-based inhibitors of carbonic anhydrase isoforms I, II, IX and XII evidence a new binding mode within the enzyme active site. Bioorg Med Chem 19:1381-9 (2011)  
Target
Name:
Carbonic anhydrase 9
Synonyms:
CA-IX CAH9_HUMAN Carbonic anhydrase 9 (CA IX) Carbonic anhydrase 9 precursor Carbonic anhydrase IX (CAIX) Carbonic anhydrases; II & IX MN RCC-associated antigen G250
Type:
Enzyme
Mol. Mass.:
49669.03
Organism:
Homo sapiens (Human)
Description:
Catalytic domain of human cloned isozyme was used in the assay
Residue:
459
  
Inhibitor
Name:
BDBM26187
Synonyms:
α-CA inhibitor, 11 US9688816, 2 | phenol
Type:
Small organic molecule
Emp. Form.:
C6H6O
Mol. Mass.:
94.1112
SMILES:
Oc1ccccc1
: