Target
Aminopeptidase N
Ligand
BDBM50336499
Substrate
Meas. Tech.
ChEMBL_716908 (CHEMBL1670936)
Ki
60000±n/a nM
Citation
 Albrecht, SAl-Lakkis-Wehbe, MOrsini, ADefoin, APale, PSalomon, ETarnus, CWeibel, JM Amino-benzosuberone: a novel warhead for selective inhibition of human aminopeptidase-N/CD13. Bioorg Med Chem 19:1434-49 (2011)  
Target
Name:
Aminopeptidase N
Synonyms:
AMPN_HUMAN APN Aminopeptidase CD_antigen=CD13 Myeloid plasma membrane glycoprotein CD13 gp150 | hAPN
Type:
PROTEIN
Mol. Mass.:
109522.63
Organism:
Homo sapiens (Human)
Description:
ChEMBL_1507526
Residue:
967
  
Inhibitor
Name:
BDBM50336499
Synonyms:
CHEMBL1668630 | cis-7-amino-6,7,8,9-tetrahydro-5H-benzocyclohepten-6-ol hydrochloride
Type:
Small organic molecule
Emp. Form.:
C11H15NO
Mol. Mass.:
177.2429
SMILES:
N[C@H]1CCc2ccccc2C[C@H]1O
: