Target
Induced myeloid leukemia cell differentiation protein Mcl-1
Ligand
BDBM50336586
Substrate
Meas. Tech.
ChEMBL_725602 (CHEMBL1677785)
Ki
82±n/a nM
Citation
 Zhang, ZWu, GXie, FSong, TChang, X 3-Thiomorpholin-8-oxo-8H-acenaphtho[1,2-b]pyrrole-9-carbonitrile (S1) based molecules as potent, dual inhibitors of B-cell lymphoma 2 (Bcl-2) and myeloid cell leukemia sequence 1 (Mcl-1): structure-based design and structure-activity relationship studies. J Med Chem 54:1101-5 (2011)  
Target
Name:
Induced myeloid leukemia cell differentiation protein Mcl-1
Synonyms:
BCL2L3 Bcl-2-like protein 3 (Mcl-1) Bcl2-L-3 MCL1 Mcl-1 Myeloid cell leukemia sequence 1 (BCL2-related) | mcl1/EAT
Type:
Membrane; Single-pass membrane protein
Mol. Mass.:
37332.87
Organism:
Homo sapiens (Human)
Description:
Q07820
Residue:
350
  
Inhibitor
Name:
BDBM50336586
Synonyms:
3-(4-isopropylthiophenol)-8-oxo-8H-acenaphtho[1,2-b]pyrrole-9-carbonitrile | CHEMBL1672078
Type:
Small organic molecule
Emp. Form.:
C24H16N2OS
Mol. Mass.:
380.462
SMILES:
CC(C)c1ccc(Sc2ccc3c4c(C#N)c(=O)nc4c4cccc2c34)cc1
: