Target
Delta-type opioid receptor
Ligand
BDBM50336596
Substrate
Meas. Tech.
ChEMBL_725618 (CHEMBL1677801)
Ki
0.810000±n/a nM
Citation
 Spetea, MWindisch, PGuo, YBileviciute-Ljungar, ISchütz, JAsim, MFBerzetei-Gurske, IPRiba, PKiraly, KFürst, SAl-Khrasani, MSchmidhammer, H Synthesis and pharmacological activities of 6-glycine substituted 14-phenylpropoxymorphinans, a novel class of opioids with high opioid receptor affinities and antinociceptive potencies. J Med Chem 54:980-8 (2011)  
Target
Name:
Delta-type opioid receptor
Synonyms:
Cytochrome P450 3A4 Delta opioid receptor Delta-type opioid receptor (DOR) OPRD_RAT Opioid receptor Opioid receptors; mu & delta Ror-a | Voltage-gated potassium channel
Type:
G Protein-Coupled Receptor (GPCR)
Mol. Mass.:
40465.04
Organism:
Rattus norvegicus (rat)
Description:
Competition binding assays were using CHO-K1 cell membranes expressing the opioid receptor.
Residue:
372
  
Inhibitor
Name:
BDBM50336596
Synonyms:
CHEMBL3216716 | [[4,5alpha-Epoxy-3-hydroxy-17-methyl-14beta-[(3-phenylpropyl)oxy]morphinan-6alpha-yl]amino]acetic Acid Dihydrochloride
Type:
Small organic molecule
Emp. Form.:
C28H36Cl2N2O5
Mol. Mass.:
551.502
SMILES:
Cl.Cl.[H][C@@]12Oc3c4c(C[C@@]5([H])N(C)CC[C@@]14[C@]5(CC[C@H]2NCC(O)=O)OCCCc1ccccc1)ccc3O
: