Target
Delta-type opioid receptor
Ligand
BDBM50336607
Substrate
Meas. Tech.
ChEMBL_725831 (CHEMBL1678427)
Ki
152±n/a nM
Citation
 Cheng, KLee, YSRothman, RBDersch, CMBittman, RWJacobson, AERice, KC Probes for narcotic receptor mediated phenomena. 41. Unusual inverseµ-agonists and potentµ-opioid antagonists by modification of the N-substituent in enantiomeric 5-(3-hydroxyphenyl)morphans. J Med Chem 54:957-69 (2011)  
Target
Name:
Delta-type opioid receptor
Synonyms:
D-OR-1 Delta opioid receptor OPIATE Delta OPRD1 OPRK1 | opioid receptor, delta 1
Type:
G Protein-Coupled Receptor (GPCR)
Mol. Mass.:
40382.98
Organism:
Homo sapiens (Human)
Description:
Competition binding assays were carried out using membrane preparations from transfected HN9.10 cells that constitutively expressed the delta opioid receptor.
Residue:
372
  
Inhibitor
Name:
BDBM50336607
Synonyms:
3-((1R,5S)-2-Cinnamyl-2-azabicyclo[3.3.1]nonan-5-yl)phenol hydrochloride | CHEMBL1672178
Type:
Small organic molecule
Emp. Form.:
C23H27NO
Mol. Mass.:
333.4666
SMILES:
Oc1cccc(c1)[C@@]12CCC[C@@H](C1)N(C\C=C\c1ccccc1)CC2
: