Target
Kappa-type opioid receptor
Ligand
BDBM50336611
Substrate
Meas. Tech.
ChEMBL_725832 (CHEMBL1678428)
Ki
72±n/a nM
Citation
 Cheng, KLee, YSRothman, RBDersch, CMBittman, RWJacobson, AERice, KC Probes for narcotic receptor mediated phenomena. 41. Unusual inverseµ-agonists and potentµ-opioid antagonists by modification of the N-substituent in enantiomeric 5-(3-hydroxyphenyl)morphans. J Med Chem 54:957-69 (2011)  
Target
Name:
Kappa-type opioid receptor
Synonyms:
K-OR-1 Kappa-opioid receptor (KOR) Kappa-type opioid receptor (KOR) OPIATE Kappa OPRK1 kappa opioid receptor (KOR)
Type:
G Protein-Coupled Receptor (GPCR)
Mol. Mass.:
42648.76
Organism:
Homo sapiens (Human)
Description:
P41145
Residue:
380
  
Inhibitor
Name:
BDBM50336611
Synonyms:
3-((1R,5S)-2-(((1'S,2'S)-2-Phenylcyclopropyl)methyl)-2-azabicyclo[3.3.1]nonan-5-yl)phenol hydrochloride | CHEMBL1672182
Type:
Small organic molecule
Emp. Form.:
C24H29NO
Mol. Mass.:
347.4932
SMILES:
Oc1cccc(c1)[C@@]12CCC[C@@H](C1)N(C[C@H]1C[C@@H]1c1ccccc1)CC2
: