Target
Carbonic anhydrase 1
Ligand
BDBM10888
Substrate
Meas. Tech.
ChEMBL_726066 (CHEMBL1678662)
pH
7.5±n/a
Ki
56±n/a nM
Comments
extracted
Citation
 Joseph, POuahrani-Bettache, SMontero, JLNishimori, IMinakuchi, TVullo, DScozzafava, AWinum, JYKöhler, SSupuran, CT A newß-carbonic anhydrase from Brucella suis, its cloning, characterization, and inhibition with sulfonamides and sulfamates, leading to impaired pathogen growth. Bioorg Med Chem 19:1172-8 (2011)  
Target
Name:
Carbonic anhydrase 1
Synonyms:
CA-I CAB Carbonate dehydratase I Carbonic anhydrase 1 (CA I) Carbonic anhydrase 1 (Recombinant CA I) Carbonic anhydrase B Carbonic anhydrase I (CA I) Carbonic anhydrase I (CAI) Carbonic anhydrase isoenzyme I (hCA I) | hCA
Type:
Enzyme
Mol. Mass.:
28873.37
Organism:
Homo sapiens (Human)
Description:
P00915
Residue:
261
  
Inhibitor
Name:
BDBM10888
Synonyms:
1,2-benzoxazol-3-ylmethanesulfonamide SPR_2 Zonisamide Zonisamide (ZNS) Zonisamide, ZNS
Type:
Small organic molecule
Emp. Form.:
C8H8N2O3S
Mol. Mass.:
212.226
SMILES:
NS(=O)(=O)Cc1noc2ccccc12
: