Target
Carbonic anhydrase 2
Ligand
BDBM11611
Substrate
Meas. Tech.
ChEMBL_726067 (CHEMBL1678663)
pH
7.5±n/a
Ki
73±n/a nM
Comments
extracted
Citation
 Joseph, POuahrani-Bettache, SMontero, JLNishimori, IMinakuchi, TVullo, DScozzafava, AWinum, JYKöhler, SSupuran, CT A newß-carbonic anhydrase from Brucella suis, its cloning, characterization, and inhibition with sulfonamides and sulfamates, leading to impaired pathogen growth. Bioorg Med Chem 19:1172-8 (2011)  
Target
Name:
Carbonic anhydrase 2
Synonyms:
CA-II CAC Carbonate dehydratase II Carbonic anhydrase 2 (CA-II) Carbonic anhydrase C Carbonic anhydrase II (CA-II) Carbonic anhydrase II (hCA II) | Carbonic anhydrase isoenzyme II (hCA II)
Type:
Enzyme
Mol. Mass.:
29250.71
Organism:
Homo sapiens (Human)
Description:
P00918
Residue:
260
  
Inhibitor
Name:
BDBM11611
Synonyms:
β-CA inhibitor, 10 4-amino-3,5-dibromobenzene-1-sulfonamide halogenosulfanilamide deriv. 12
Type:
Small organic molecule
Emp. Form.:
C6H6Br2N2O2S
Mol. Mass.:
329.997
SMILES:
Nc1c(Br)cc(cc1Br)S(N)(=O)=O
: