Target
Endothelin receptor type B
Ligand
BDBM50304496
Substrate
Meas. Tech.
ChEMBL_723170 (CHEMBL1675392)
Ki
240±n/a nM
Citation
 Michel, KBüther, KLaw, MPWagner, SSchober, OHermann, SSchäfers, MRiemann, BHöltke, CKopka, K Development and evaluation of endothelin-A receptor (radio)ligands for positron emission tomography. J Med Chem 54:939-48 (2011)  
Target
Name:
Endothelin receptor type B
Synonyms:
EDNRB_MOUSE ET-BR Endothelin B receptor | Endothelin receptor non-selective type
Type:
PROTEIN
Mol. Mass.:
49587.98
Organism:
Mus musculus
Description:
ChEMBL_603858
Residue:
442
  
Inhibitor
Name:
BDBM50304496
Synonyms:
3-Benzo[1,3]dioxol-5-yl-4-[3-(2-fluoroethoxy)-4,5-dimethoxybenzyl]-5-hydroxy-5-(4-methoxyphenyl)-5H-furan-2-one | CHEMBL594482
Type:
Small organic molecule
Emp. Form.:
C29H27FO9
Mol. Mass.:
538.5177
SMILES:
COc1ccc(cc1)C1(O)OC(=O)C(=C1Cc1cc(OC)c(OC)c(OCCF)c1)c1ccc2OCOc2c1
: