Target
Phosphatidylinositol 4,5-bisphosphate 3-kinase catalytic subunit alpha isoform
Ligand
BDBM50336866
Substrate
Meas. Tech.
ChEMBL_718445 (CHEMBL1680109)
EC50
370±n/a nM
Citation
 Burger, MTKnapp, MWagman, ANi, ZJHendrickson, TAtallah, GZhang, YFrazier, KVerhagen, JPfister, KNg, SSmith, ABartulis, SMerrit, HWeismann, MXin, XHaznedar, JVoliva, CFIwanowicz, EPecchi, S Synthesis and in Vitro and in Vivo Evaluation of Phosphoinositide-3-kinase Inhibitors ACS Med Chem Lett 2:34-38 (2011)  
Target
Name:
Phosphatidylinositol 4,5-bisphosphate 3-kinase catalytic subunit alpha isoform
Synonyms:
P42336 PI3-kinase subunit p110-alpha PIK3CA Phosphatidylinositol 3-kinase alpha (PI3Kalpha) Phosphatidylinositol 4,5-bisphosphate 3-kinase (PI3K) Phosphatidylinositol 4,5-bisphosphate 3-kinase catalytic subunit alpha (PI3Kalpha) Phosphatidylinositol 4,5-bisphosphate 3-kinase catalytic subunit alpha isoform (PI3-Ka) Phosphatidylinositol 4,5-bisphosphate 3-kinase catalytic subunit alpha isoform (PI3K p110alpha) Phosphatidylinositol 4,5-bisphosphate 3-kinase catalytic subunit alpha isoform (PI3K-alpha) Phosphatidylinositol 4,5-bisphosphate 3-kinase catalytic subunit alpha isoform (PI3Kalpha p110alpha) Phosphatidylinositol 4,5-bisphosphate 3-kinase catalytic subunit alpha isoform (PIK3CA) Phosphatidylinositol-4,5-bisphosphate 3-kinase catalytic subunit alpha isoform Phosphoinositide 3-Kinase (PI3K), alpha Chain A Phosphoinositide 3-kinases (PI3K) PtdIns-3-kinase p110 | p110 alpha
Type:
Enzyme Subunit
Mol. Mass.:
124294.87
Organism:
Homo sapiens (Human)
Description:
P42336
Residue:
1068
  
Inhibitor
Name:
BDBM50336866
Synonyms:
3-(2-morpholino-6-(quinolin-3-ylamino)pyrimidin-4-yl)phenol | CHEMBL1672314
Type:
Small organic molecule
Emp. Form.:
C23H21N5O2
Mol. Mass.:
399.4451
SMILES:
Oc1cccc(c1)-c1cc(Nc2cnc3ccccc3c2)nc(n1)N1CCOCC1
: