Target
Phosphatidylinositol 4,5-bisphosphate 3-kinase catalytic subunit alpha isoform
Ligand
BDBM50336865
Substrate
Meas. Tech.
ChEMBL_718445 (CHEMBL1680109)
EC50
90±n/a nM
Citation
 Burger, MTKnapp, MWagman, ANi, ZJHendrickson, TAtallah, GZhang, YFrazier, KVerhagen, JPfister, KNg, SSmith, ABartulis, SMerrit, HWeismann, MXin, XHaznedar, JVoliva, CFIwanowicz, EPecchi, S Synthesis and in Vitro and in Vivo Evaluation of Phosphoinositide-3-kinase Inhibitors ACS Med Chem Lett 2:34-38 (2011)  
Target
Name:
Phosphatidylinositol 4,5-bisphosphate 3-kinase catalytic subunit alpha isoform
Synonyms:
P42336 PI3-kinase subunit p110-alpha PIK3CA Phosphatidylinositol 3-kinase alpha (PI3Kalpha) Phosphatidylinositol 4,5-bisphosphate 3-kinase (PI3K) Phosphatidylinositol 4,5-bisphosphate 3-kinase catalytic subunit alpha (PI3Kalpha) Phosphatidylinositol 4,5-bisphosphate 3-kinase catalytic subunit alpha isoform (PI3-Ka) Phosphatidylinositol 4,5-bisphosphate 3-kinase catalytic subunit alpha isoform (PI3K p110alpha) Phosphatidylinositol 4,5-bisphosphate 3-kinase catalytic subunit alpha isoform (PI3K-alpha) Phosphatidylinositol 4,5-bisphosphate 3-kinase catalytic subunit alpha isoform (PI3Kalpha p110alpha) Phosphatidylinositol 4,5-bisphosphate 3-kinase catalytic subunit alpha isoform (PIK3CA) Phosphatidylinositol-4,5-bisphosphate 3-kinase catalytic subunit alpha isoform Phosphoinositide 3-Kinase (PI3K), alpha Chain A Phosphoinositide 3-kinases (PI3K) PtdIns-3-kinase p110 | p110 alpha
Type:
Enzyme Subunit
Mol. Mass.:
124294.87
Organism:
Homo sapiens (Human)
Description:
P42336
Residue:
1068
  
Inhibitor
Name:
BDBM50336865
Synonyms:
CHEMBL1672328 | N6-(6-methoxypyridin-3-yl)-2-morpholino-4,5'-bipyrimidine-2',6-diamine
Type:
Small organic molecule
Emp. Form.:
C18H20N8O2
Mol. Mass.:
380.4038
SMILES:
COc1ccc(Nc2cc(nc(n2)N2CCOCC2)-c2cnc(N)nc2)cn1
: