Target
Cytochrome P450 2C9
Ligand
BDBM50336978
Substrate
Meas. Tech.
ChEMBL_719025 (CHEMBL1679087)
IC50
>25000±n/a nM
Citation
 Eastwood, PEsteve, CGonzález, JFonquerna, SAiguadé, JCarranco, IsDoménech, TAparici, MsMiralpeix, MAlbertí, JCórdoba, MFernández, RPont, MsGodessart, NsPrats, NLoza, MsCadavid, MsNueda, A Discovery of LAS101057: A Potent, Selective, and Orally Efficacious A2B Adenosine Receptor Antagonist ACS Med Chem Lett 2:213-218 (2011)  
Target
Name:
Cytochrome P450 2C9
Synonyms:
(R)-limonene 6-monooxygenase CP2C9_HUMAN CYP2C9 Cytochrome P450 2C9 (CYP2C9 ) P-450MP P450 PB-1 | S-mephenytoin 4-hydroxylase
Type:
Enzyme
Mol. Mass.:
55636.33
Organism:
Homo sapiens (Human)
Description:
P11712
Residue:
490
  
Inhibitor
Name:
BDBM50336978
Synonyms:
CHEMBL1672630 | N-(5-(3-chloropyridin-4-yl)-6-(pyridin-2-yl)pyrazin-2-yl)cyclopropanecarboxamide
Type:
Small organic molecule
Emp. Form.:
C18H14FN5O
Mol. Mass.:
335.3351
SMILES:
Fc1cnccc1-c1ncc(NC(=O)C2CC2)nc1-c1ccncc1
: