Target
D-alanyl-D-alanine carboxypeptidase
Ligand
BDBM50337101
Substrate
Meas. Tech.
ChEMBL_718756 (CHEMBL1681054)
Ki
105±n/a nM
Citation
 Woon, ECZervosen, ASauvage, ESimmons, KJZivec, MInglis, SRFishwick, CWGobec, SCharlier, PLuxen, As Structure Guided Development of Potent Reversibly Binding Penicillin Binding Protein Inhibitors ACS Med Chem Lett 2:219-223 (2011)  
Target
Name:
D-alanyl-D-alanine carboxypeptidase
Synonyms:
DAC_ACTSP | dac
Type:
PROTEIN
Mol. Mass.:
54928.46
Organism:
Actinomadura sp. (strain R39)
Description:
ChEMBL_822544
Residue:
538
  
Inhibitor
Name:
BDBM50337101
Synonyms:
(S)-1-(2-(Naphthalen-2-ylcarbonyl)benzamido)ethaneboronic acid | CHEMBL1672909
Type:
Small organic molecule
Emp. Form.:
C20H18BNO4
Mol. Mass.:
347.172
SMILES:
C[C@@H](NC(=O)c1ccccc1C(=O)c1ccc2ccccc2c1)B(O)O
: