Target
Aromatase
Ligand
BDBM50337121
Substrate
Meas. Tech.
ChEMBL_718780 (CHEMBL1681078)
IC50
0.015±n/a nM
Citation
 Woo, LWBubert, CPurohit, A Hybrid Dual Aromatase-Steroid Sulfatase Inhibitors with Exquisite Picomolar Inhibitory Activity ACS Med Chem Lett 2:243-247 (2011)  
Target
Name:
Aromatase
Synonyms:
ARO1 CP19A_HUMAN CYP19 CYPXIX Cytochrome P450 19A1 Cytochrome P450-C19 (CYP19) FL cytokine receptor precursor | P-450AROM
Type:
Enzyme
Mol. Mass.:
57888.92
Organism:
Homo sapiens (Human)
Description:
P11511
Residue:
503
  
Inhibitor
Name:
BDBM50337121
Synonyms:
2-chloro-4-(((6-cyanobiphenyl-3-yl)(4H-1,2,4-triazol-4-yl)amino)methyl)phenyl sulfamate | CHEMBL1672978
Type:
Small organic molecule
Emp. Form.:
C22H17ClN6O3S
Mol. Mass.:
480.927
SMILES:
NS(=O)(=O)Oc1ccc(CN(c2ccc(C#N)c(c2)-c2ccccc2)n2cnnc2)cc1Cl
: