Target
Cholesteryl ester transfer protein
Ligand
BDBM50337194
Substrate
Meas. Tech.
ChEMBL_726319 (CHEMBL1687307)
IC50
19±n/a nM
Citation
 Sweis, RFHunt, JAKallashi, FHammond, MLChen, YEveland, SSGuo, QHyland, SAMilot, DPCumiskey, AMLatham, MRosa, RPeterson, LSparrow, CPWright, SDAnderson, MSSinclair, PJ 2-(4-carbonylphenyl)benzoxazole inhibitors of CETP: scaffold design and advancement in HDLc-raising efficacy. Bioorg Med Chem Lett 21:1890-5 (2011)  
Target
Name:
Cholesteryl ester transfer protein
Synonyms:
CETP Cholesteryl ester transfer protein (CETP) | Lipid transfer protein I
Type:
Enzyme
Mol. Mass.:
54751.53
Organism:
Homo sapiens (Human)
Description:
P11597
Residue:
493
  
Inhibitor
Name:
BDBM50337194
Synonyms:
4-(5-cyano-7-isopropylbenzo[d]oxazol-2-yl)-N-((1-(5-(2-isopropylphenyl)pyridin-2-yl)piperidin-4-yl)methyl)benzamide | CHEMBL1684870
Type:
Small organic molecule
Emp. Form.:
C38H39N5O2
Mol. Mass.:
597.7486
SMILES:
CC(C)c1ccccc1-c1ccc(nc1)N1CCC(CNC(=O)c2ccc(cc2)-c2nc3cc(cc(C(C)C)c3o2)C#N)CC1
: