Target
Gamma-aminobutyric acid receptor subunit alpha-1
Ligand
BDBM50337276
Substrate
Meas. Tech.
ChEMBL_726365 (CHEMBL1687497)
IC50
>3000±n/a nM
Citation
 Hintermann, SHurth, KNozulak, JTintelnot-Blomley, MAichholz, RBlanz, JKaupmann, KMosbacher, J Exploring subtype selectivity and metabolic stability of a novel series of ligands for the benzodiazepine binding site of the GABAA receptor. Bioorg Med Chem Lett 21:1523-6 (2011)  
Target
Name:
Gamma-aminobutyric acid receptor subunit alpha-1
Synonyms:
Benzodiazepine central GABA A Benzodiazepine liver GABA(A) receptor subunit alpha-1 GABA-A receptor GBRA1_HUMAN TBPS | agonist GABA site
Type:
Protein
Mol. Mass.:
51817.35
Organism:
Homo sapiens (Human)
Description:
P14867
Residue:
456
  
Inhibitor
Name:
BDBM50337276
Synonyms:
3-(2-chlorophenoxy)-2-(4-chlorophenyl)-6,7,8,9-tetrahydro-2H-pyrazolo[4,3-c]quinoline | CHEMBL1681898
Type:
Small organic molecule
Emp. Form.:
C22H17Cl2N3O
Mol. Mass.:
410.296
SMILES:
Clc1ccc(cc1)-n1nc2c3CCCCc3ncc2c1Oc1ccccc1Cl
: