Target
Beta-1 adrenergic receptor
Ligand
BDBM50337291
Substrate
Meas. Tech.
ChEMBL_726483 (CHEMBL1685250)
EC50
>10000±n/a nM
Citation
 Pérez, DCrespo, MSolé, LPrat, MCarcasona, CCalama, EOtal, RGavaldá, AGómez-Angelats, MMiralpeix, MPuig, C Discovery of substituted phenyl urea derivatives as novel long-actingß2-adrenoreceptor agonists. Bioorg Med Chem Lett 21:1545-8 (2011)  
Target
Name:
Beta-1 adrenergic receptor
Synonyms:
ADRB1R, B1AR Adrb1 Adrenergic receptor beta Beta-1 adrenoreceptor adrenergic Beta1,2
Type:
Protein
Mol. Mass.:
50486.84
Organism:
Rattus norvegicus (Rat)
Description:
P18090
Residue:
466
  
Inhibitor
Name:
BDBM50337291
Synonyms:
1-(3-(2-(2-hydroxy-2-(8-hydroxy-2-oxo-1,2-dihydroquinolin-5-yl)ethylamino)ethyl)phenyl)-3-(3-phenylpropyl)urea | CHEMBL1682213
Type:
Small organic molecule
Emp. Form.:
C29H32N4O4
Mol. Mass.:
500.5888
SMILES:
OC(CNCCc1cccc(NC(=O)NCCCc2ccccc2)c1)c1ccc(O)c2[nH]c(=O)ccc12
: