Target
Beta-1 adrenergic receptor
Ligand
BDBM50337295
Substrate
Meas. Tech.
ChEMBL_726483 (CHEMBL1685250)
EC50
8890±n/a nM
Citation
 Pérez, DCrespo, MSolé, LPrat, MCarcasona, CCalama, EOtal, RGavaldá, AGómez-Angelats, MMiralpeix, MPuig, C Discovery of substituted phenyl urea derivatives as novel long-actingß2-adrenoreceptor agonists. Bioorg Med Chem Lett 21:1545-8 (2011)  
Target
Name:
Beta-1 adrenergic receptor
Synonyms:
ADRB1R, B1AR Adrb1 Adrenergic receptor beta Beta-1 adrenoreceptor adrenergic Beta1,2
Type:
Protein
Mol. Mass.:
50486.84
Organism:
Rattus norvegicus (Rat)
Description:
P18090
Residue:
466
  
Inhibitor
Name:
BDBM50337295
Synonyms:
1-benzhydryl-3-(3-(2-(2-hydroxy-2-(8-hydroxy-2-oxo-1,2-dihydroquinolin-5-yl)ethylamino)ethyl)phenyl)urea | CHEMBL1682218
Type:
Small organic molecule
Emp. Form.:
C33H32N4O4
Mol. Mass.:
548.6316
SMILES:
OC(CNCCc1cccc(NC(=O)NC(c2ccccc2)c2ccccc2)c1)c1ccc(O)c2[nH]c(=O)ccc12
: