Target
Beta-2 adrenergic receptor
Ligand
BDBM50337300
Substrate
Meas. Tech.
ChEMBL_726482 (CHEMBL1685249)
EC50
0.20±n/a nM
Citation
 Pérez, DCrespo, MSolé, LPrat, MCarcasona, CCalama, EOtal, RGavaldá, AGómez-Angelats, MMiralpeix, MPuig, C Discovery of substituted phenyl urea derivatives as novel long-actingß2-adrenoreceptor agonists. Bioorg Med Chem Lett 21:1545-8 (2011)  
Target
Name:
Beta-2 adrenergic receptor
Synonyms:
ADRB2_CAVPO adrenergic Beta2
Type:
Enzyme Catalytic Domain
Mol. Mass.:
46993.24
Organism:
GUINEA PIG
Description:
adrenergic Beta2 ADRB2 GUINEA PIG::Q8K4Z4
Residue:
418
  
Inhibitor
Name:
BDBM50337300
Synonyms:
1-benzyl-3-(3-(2-(2-hydroxy-2-(8-hydroxy-2-oxo-1,2-dihydroquinolin-5-yl)ethylamino)ethyl)phenyl)urea | CHEMBL1682211
Type:
Small organic molecule
Emp. Form.:
C27H28N4O4
Mol. Mass.:
472.5356
SMILES:
OC(CNCCc1cccc(NC(=O)NCc2ccccc2)c1)c1ccc(O)c2[nH]c(=O)ccc12
: