Target
Beta-2 adrenergic receptor
Ligand
BDBM50337298
Substrate
Meas. Tech.
ChEMBL_726482 (CHEMBL1685249)
EC50
1±n/a nM
Citation
 Pérez, DCrespo, MSolé, LPrat, MCarcasona, CCalama, EOtal, RGavaldá, AGómez-Angelats, MMiralpeix, MPuig, C Discovery of substituted phenyl urea derivatives as novel long-actingß2-adrenoreceptor agonists. Bioorg Med Chem Lett 21:1545-8 (2011)  
Target
Name:
Beta-2 adrenergic receptor
Synonyms:
ADRB2_CAVPO adrenergic Beta2
Type:
Enzyme Catalytic Domain
Mol. Mass.:
46993.24
Organism:
GUINEA PIG
Description:
adrenergic Beta2 ADRB2 GUINEA PIG::Q8K4Z4
Residue:
418
  
Inhibitor
Name:
BDBM50337298
Synonyms:
1-(3-(2-(2-hydroxy-2-(8-hydroxy-2-oxo-1,2-dihydroquinolin-5-yl)ethylamino)ethyl)phenyl)-3-(3-phenoxyphenyl)urea | CHEMBL1682221
Type:
Small organic molecule
Emp. Form.:
C32H30N4O5
Mol. Mass.:
550.6044
SMILES:
OC(CNCCc1cccc(NC(=O)Nc2cccc(Oc3ccccc3)c2)c1)c1ccc(O)c2[nH]c(=O)ccc12
: