Target
Epidermal growth factor receptor
Ligand
BDBM50337306
Substrate
Meas. Tech.
ChEMBL_726507 (CHEMBL1685402)
Ki
>1800±n/a nM
Citation
 Akritopoulou-Zanze, IWakefield, BDGasiecki, AKalvin, DJohnson, EFKovar, PDjuric, SW Scaffold oriented synthesis. Part 3: design, synthesis and biological evaluation of novel 5-substituted indazoles as potent and selective kinase inhibitors employing [2+3] cycloadditions. Bioorg Med Chem Lett 21:1476-9 (2011)  
Target
Name:
Epidermal growth factor receptor
Synonyms:
EGF Receptor Substrate EGFR_HUMAN ERBB1 Epidermal Growth Factor Receptor erbB-1 Epidermal growth factor receptor (EGFR) HER1 Proto-oncogene c-ErbB-1 Tyrosine-Protein Kinase ErbB-1
Type:
Receptor Kinase Domain
Mol. Mass.:
134279.59
Organism:
Homo sapiens (Human)
Description:
P00533
Residue:
1210
  
Inhibitor
Name:
BDBM50337306
Synonyms:
3-(1-(1H-indazol-5-yl)-1H-1,2,3-triazol-4-yl)propan-1-ol | CHEMBL1682337
Type:
Small organic molecule
Emp. Form.:
C12H13N5O
Mol. Mass.:
243.2645
SMILES:
OCCCc1cn(nn1)-c1ccc2[nH]ncc2c1
: