Target
Rho-associated protein kinase 2
Ligand
BDBM50337366
Substrate
Meas. Tech.
ChEMBL_726541 (CHEMBL1685436)
Ki
6±n/a nM
Citation
 Akritopoulou-Zanze, IWakefield, BDGasiecki, AKalvin, DJohnson, EFKovar, PDjuric, SW Scaffold oriented synthesis. Part 4: design, synthesis and biological evaluation of novel 5-substituted indazoles as potent and selective kinase inhibitors employing heterocycle forming and multicomponent reactions. Bioorg Med Chem Lett 21:1480-3 (2011)  
Target
Name:
Rho-associated protein kinase 2
Synonyms:
KIAA0619 ROCK2 Rho kinase 2 (ROCKII) Rho-associated protein kinase 2 (ROCK2) Rho-associated protein kinase 2/Transforming protein RhoA Rho-associated, coiled-coil-containing protein kinase II p164 ROCK-2
Type:
Protein
Mol. Mass.:
160885.43
Organism:
Homo sapiens (Human)
Description:
O75116
Residue:
1388
  
Inhibitor
Name:
BDBM50337366
Synonyms:
2-(1H-indazol-5-yl)-3-phenylimidazo[1,2-a]pyrimidine | CHEMBL1682541
Type:
Small organic molecule
Emp. Form.:
C19H13N5
Mol. Mass.:
311.34
SMILES:
c1n[nH]c2ccc(cc12)-c1nc2ncccn2c1-c1ccccc1
: