Target
Epidermal growth factor receptor
Ligand
BDBM50337371
Substrate
Meas. Tech.
ChEMBL_726535 (CHEMBL1685430)
Ki
>1800±n/a nM
Citation
 Akritopoulou-Zanze, IWakefield, BDGasiecki, AKalvin, DJohnson, EFKovar, PDjuric, SW Scaffold oriented synthesis. Part 4: design, synthesis and biological evaluation of novel 5-substituted indazoles as potent and selective kinase inhibitors employing heterocycle forming and multicomponent reactions. Bioorg Med Chem Lett 21:1480-3 (2011)  
Target
Name:
Epidermal growth factor receptor
Synonyms:
EGF Receptor Substrate EGFR_HUMAN ERBB1 Epidermal Growth Factor Receptor erbB-1 Epidermal growth factor receptor (EGFR) HER1 Proto-oncogene c-ErbB-1 Tyrosine-Protein Kinase ErbB-1
Type:
Receptor Kinase Domain
Mol. Mass.:
134279.59
Organism:
Homo sapiens (Human)
Description:
P00533
Residue:
1210
  
Inhibitor
Name:
BDBM50337371
Synonyms:
CHEMBL1682546 | N-benzyl-4-(1H-indazol-5-yl)thiazol-2-amine
Type:
Small organic molecule
Emp. Form.:
C17H14N4S
Mol. Mass.:
306.385
SMILES:
C(Nc1nc(cs1)-c1ccc2[nH]ncc2c1)c1ccccc1
: