Target
Neuromedin-K receptor
Ligand
BDBM50337402
Substrate
Meas. Tech.
ChEMBL_728369 (CHEMBL1685145)
Ki
6.1±n/a nM
Citation
 Juhl, KHansen, TKehler, JKhanzhin, NANørgaard, MBRuhland, TLarsen, DBJensen, KGSteiniger-Brach, BNielsen, SMSimonsen, KB Identification of a new series of non-peptidic NK3 receptor antagonists. Bioorg Med Chem Lett 21:1498-501 (2011)  
Target
Name:
Neuromedin-K receptor
Synonyms:
NK-3 receptor NK3R NKR Neurokinin B receptor Neuromedin-3 receptor (NK-3R) Neuromedin-K receptor Neuromedin-K receptor (NK3) TAC3R Tachykinin receptor 3 | Tachykinin receptor 3 (NK3)
Type:
Enzyme
Mol. Mass.:
52221.96
Organism:
Homo sapiens (Human)
Description:
P29371
Residue:
465
  
Inhibitor
Name:
BDBM50337402
Synonyms:
(1S,2R)-N-benzyl-1-(3,4-dichlorophenyl)-N-methyl-2-((4-phenyl-4-(piperidine-1-carbonyl)piperidin-1-yl)methyl)cyclopropanecarboxamide | CHEMBL1682667
Type:
Small organic molecule
Emp. Form.:
C36H41Cl2N3O2
Mol. Mass.:
618.636
SMILES:
CN(Cc1ccccc1)C(=O)[C@]1(C[C@H]1CN1CCC(CC1)(C(=O)N1CCCCC1)c1ccccc1)c1ccc(Cl)c(Cl)c1
: