Target
Neuromedin-K receptor
Ligand
BDBM50337418
Substrate
Meas. Tech.
ChEMBL_728369 (CHEMBL1685145)
Ki
1.9±n/a nM
Citation
 Juhl, KHansen, TKehler, JKhanzhin, NANørgaard, MBRuhland, TLarsen, DBJensen, KGSteiniger-Brach, BNielsen, SMSimonsen, KB Identification of a new series of non-peptidic NK3 receptor antagonists. Bioorg Med Chem Lett 21:1498-501 (2011)  
Target
Name:
Neuromedin-K receptor
Synonyms:
NK-3 receptor NK3R NKR Neurokinin B receptor Neuromedin-3 receptor (NK-3R) Neuromedin-K receptor Neuromedin-K receptor (NK3) TAC3R Tachykinin receptor 3 | Tachykinin receptor 3 (NK3)
Type:
Enzyme
Mol. Mass.:
52221.96
Organism:
Homo sapiens (Human)
Description:
P29371
Residue:
465
  
Inhibitor
Name:
BDBM50337418
Synonyms:
(1S,2R)-1-(3,4-dichlorophenyl)-2-((3-(4-(N,N-dimethylsulfamoyl)piperazin-1-yl)azetidin-1-yl)methyl)-N-(4-fluorobenzyl)-N-methylcyclopropanecarboxamide | CHEMBL1682683
Type:
Small organic molecule
Emp. Form.:
C28H36Cl2FN5O3S
Mol. Mass.:
612.587
SMILES:
CN(C)S(=O)(=O)N1CCN(CC1)C1CN(C[C@@H]2C[C@@]2(C(=O)N(C)Cc2ccc(F)cc2)c2ccc(Cl)c(Cl)c2)C1
: