Target
Neuromedin-K receptor
Ligand
BDBM50337439
Substrate
Meas. Tech.
ChEMBL_728369 (CHEMBL1685145)
Ki
13±n/a nM
Citation
 Juhl, KHansen, TKehler, JKhanzhin, NANørgaard, MBRuhland, TLarsen, DBJensen, KGSteiniger-Brach, BNielsen, SMSimonsen, KB Identification of a new series of non-peptidic NK3 receptor antagonists. Bioorg Med Chem Lett 21:1498-501 (2011)  
Target
Name:
Neuromedin-K receptor
Synonyms:
NK-3 receptor NK3R NKR Neurokinin B receptor Neuromedin-3 receptor (NK-3R) Neuromedin-K receptor Neuromedin-K receptor (NK3) TAC3R Tachykinin receptor 3 | Tachykinin receptor 3 (NK3)
Type:
Enzyme
Mol. Mass.:
52221.96
Organism:
Homo sapiens (Human)
Description:
P29371
Residue:
465
  
Inhibitor
Name:
BDBM50337439
Synonyms:
CHEMBL1682641 | rac-2-((4-acetamido-4-phenylpiperidin-1-yl)methyl)-N-(3,4-dichlorobenzyl)-1-(3,4-dichlorophenyl)-N-methylcyclopropanecarboxamide
Type:
Small organic molecule
Emp. Form.:
C32H33Cl4N3O2
Mol. Mass.:
633.435
SMILES:
CN(Cc1ccc(Cl)c(Cl)c1)C(=O)C1(CC1CN1CCC(CC1)(NC(C)=O)c1ccccc1)c1ccc(Cl)c(Cl)c1
: