Target
Prothrombin
Ligand
BDBM50337453
Substrate
Meas. Tech.
ChEMBL_728384 (CHEMBL1685160)
Ki
0.125±n/a nM
Citation
 Isaacs, RCNewton, CLCutrona, KJMercer, SPDorsey, BDMcDonough, CMCook, JJKrueger, JALewis, SDLucas, BJLyle, EALynch, JJMiller-Stein, CMichener, MTWallace, AAWhite, RBWong, BK P3 optimization of functional potency, in vivo efficacy and oral bioavailability in 3-aminopyrazinone thrombin inhibitors bearing non-charged groups at the P1 position. Bioorg Med Chem Lett 21:1532-5 (2011)  
Target
Name:
Prothrombin
Synonyms:
Activation peptide fragment 1 Coagulation factor II Prothrombin precursor Thrombin heavy chain | Thrombin light chain
Type:
Protein
Mol. Mass.:
70029.57
Organism:
Homo sapiens (Human)
Description:
P00734
Residue:
622
  
Inhibitor
Name:
BDBM50337453
Synonyms:
2-(4-chloro-2-((2-(6-methyl-2-oxo-3-(2-(pyridin-2-yl)ethylamino)pyrazin-1(2H)-yl)acetamido)methyl)phenoxy)-N-(piperidin-3-yl)acetamide | CHEMBL1682692
Type:
Small organic molecule
Emp. Form.:
C28H34ClN7O4
Mol. Mass.:
568.067
SMILES:
Cc1cnc(NCCc2ccccn2)c(=O)n1CC(=O)NCc1cc(Cl)ccc1OCC(=O)NC1CCCNC1
: