Target
Sphingosine 1-phosphate receptor 1
Ligand
BDBM50337598
Substrate
Meas. Tech.
ChEMBL_728638 (CHEMBL1685768)
EC50
33±n/a nM
Citation
 Kurata, HOtsuki, KKusumi, KKurono, MTerakado, MSeko, TMizuno, HOno, THagiya, HMinami, MNakade, SHabashita, H Structure-activity relationship studies of sphingosine-1-phosphate receptor agonists with N-cinnamyl-ß-alanine moiety. Bioorg Med Chem Lett 21:1390-3 (2011)  
Target
Name:
Sphingosine 1-phosphate receptor 1
Synonyms:
CHEDG1 Endothelial differentiation G-protein coupled receptor 1 S1P1 S1PR1_HUMAN Sphingosine 1-phosphate receptor Edg-1
Type:
Enzyme
Mol. Mass.:
42836.02
Organism:
Homo sapiens (Human)
Description:
P21453
Residue:
382
  
Inhibitor
Name:
BDBM50337598
Synonyms:
CHEMBL1683046 | trans-3-(2-methyl-3-(4-(3-phenylpropoxy)phenyl)allylamino)propanoic acid
Type:
Small organic molecule
Emp. Form.:
C22H27NO3
Mol. Mass.:
353.4547
SMILES:
C\C(CNCCC(O)=O)=C/c1ccc(OCCCc2ccccc2)cc1
: