Target
Serine/threonine-protein kinase D1
Ligand
BDBM50337713
Substrate
Meas. Tech.
ChEMBL_728808 (CHEMBL1686343)
IC50
100±n/a nM
Citation
 Gamber, GGMeredith, EZhu, QYan, WRao, CCapparelli, MBurgis, REnyedy, IZhang, JHSoldermann, NBeattie, KRozhitskaya, OKoch, KAPagratis, NHosagrahara, VVega, RBMcKinsey, TAMonovich, L 3,5-diarylazoles as novel and selective inhibitors of protein kinase D. Bioorg Med Chem Lett 21:1447-51 (2011)  
Target
Name:
Serine/threonine-protein kinase D1
Synonyms:
KPCD1_HUMAN PKD1 PRKD1 Protein kinase C mu type Protein kinase C, PKC; classical/novel Protein kinase D (PRKD1) nPKC-D1 | nPKC-mu
Type:
Serine/threonine-protein kinase
Mol. Mass.:
101705.07
Organism:
Homo sapiens (Human)
Description:
gi_115529463
Residue:
912
  
Inhibitor
Name:
BDBM50337713
Synonyms:
CHEMBL1683433 | N-isopropyl-3-(5-(4-((isopropylamino)methyl)phenyl)-1H-pyrazol-3-yl)benzamide
Type:
Small organic molecule
Emp. Form.:
C23H28N4O
Mol. Mass.:
376.4946
SMILES:
CC(C)NCc1ccc(cc1)-c1cc([nH]n1)-c1cccc(c1)C(=O)NC(C)C
: