Target
Serine/threonine-protein kinase D1
Ligand
BDBM50337717
Substrate
Meas. Tech.
ChEMBL_728808 (CHEMBL1686343)
IC50
220±n/a nM
Citation
 Gamber, GGMeredith, EZhu, QYan, WRao, CCapparelli, MBurgis, REnyedy, IZhang, JHSoldermann, NBeattie, KRozhitskaya, OKoch, KAPagratis, NHosagrahara, VVega, RBMcKinsey, TAMonovich, L 3,5-diarylazoles as novel and selective inhibitors of protein kinase D. Bioorg Med Chem Lett 21:1447-51 (2011)  
Target
Name:
Serine/threonine-protein kinase D1
Synonyms:
KPCD1_HUMAN PKD1 PRKD1 Protein kinase C mu type Protein kinase C, PKC; classical/novel Protein kinase D (PRKD1) nPKC-D1 | nPKC-mu
Type:
Serine/threonine-protein kinase
Mol. Mass.:
101705.07
Organism:
Homo sapiens (Human)
Description:
gi_115529463
Residue:
912
  
Inhibitor
Name:
BDBM50337717
Synonyms:
CHEMBL1683437 | N-isopropyl-3-(5-(4-((tetrahydro-2H-pyran-4-ylamino)methyl)phenyl)isoxazol-3-yl)benzamide
Type:
Small organic molecule
Emp. Form.:
C25H29N3O3
Mol. Mass.:
419.5161
SMILES:
CC(C)NC(=O)c1cccc(c1)-c1cc(on1)-c1ccc(CNC2CCOCC2)cc1
: