Target
A disintegrin and metalloproteinase with thrombospondin motifs 4
Ligand
BDBM50337734
Substrate
Meas. Tech.
ChEMBL_728834 (CHEMBL1686369)
IC50
0.570000±n/a nM
Citation
 De Savi, CPape, ACumming, JGTing, ASmith, PDBurrows, JNMills, MDavies, CLamont, SMilne, DCook, CMoore, PSawyer, YGerhardt, S The design and synthesis of novel N-hydroxyformamide inhibitors of ADAM-TS4 for the treatment of osteoarthritis. Bioorg Med Chem Lett 21:1376-81 (2011)  
Target
Name:
A disintegrin and metalloproteinase with thrombospondin motifs 4
Synonyms:
A disintegrin and metalloproteinase with thrombospondin motifs 4 (ADAMTS-4) ATS4_HUMAN KIAA0688 | Metalloproteinase with thrombospondin motifs 4 (ADAMTS-4)
Type:
Enzyme
Mol. Mass.:
90214.54
Organism:
Homo sapiens (Human)
Description:
O75173
Residue:
837
  
Inhibitor
Name:
BDBM50337734
Synonyms:
CHEMBL1683464 US10322143, Compound 8q
Type:
Small organic molecule
Emp. Form.:
C25H34ClFN4O6S2
Mol. Mass.:
605.142
SMILES:
C[C@@H](C[C@@](C)(CS(=O)(=O)N1CCC(CCc2ccc(cc2Cl)S(C)(=O)=O)CC1)N(O)C=O)c1ncc(F)cn1
: