Target
A disintegrin and metalloproteinase with thrombospondin motifs 4
Ligand
BDBM50337729
Substrate
Meas. Tech.
ChEMBL_728834 (CHEMBL1686369)
IC50
3.5±n/a nM
Citation
 De Savi, CPape, ACumming, JGTing, ASmith, PDBurrows, JNMills, MDavies, CLamont, SMilne, DCook, CMoore, PSawyer, YGerhardt, S The design and synthesis of novel N-hydroxyformamide inhibitors of ADAM-TS4 for the treatment of osteoarthritis. Bioorg Med Chem Lett 21:1376-81 (2011)  
Target
Name:
A disintegrin and metalloproteinase with thrombospondin motifs 4
Synonyms:
A disintegrin and metalloproteinase with thrombospondin motifs 4 (ADAMTS-4) ATS4_HUMAN KIAA0688 | Metalloproteinase with thrombospondin motifs 4 (ADAMTS-4)
Type:
Enzyme
Mol. Mass.:
90214.54
Organism:
Homo sapiens (Human)
Description:
O75173
Residue:
837
  
Inhibitor
Name:
BDBM50337729
Synonyms:
CHEMBL1615186 N-[(2S,4S)-1-({4-[(2,4-dichlorobenzyl)oxy]piperidin-1-yl}sulfonyl)-4-(5-fluoropyrimidin-2-yl)-2-methylpentan-2-yl]-N-hydroxyformamide | US10322143, Compound 4
Type:
Small organic molecule
Emp. Form.:
C23H29Cl2FN4O5S
Mol. Mass.:
563.47
SMILES:
C[C@@H](C[C@@](C)(CS(=O)(=O)N1CCC(CC1)OCc1ccc(Cl)cc1Cl)N(O)C=O)c1ncc(F)cn1
: