Target
Dual specificity mitogen-activated protein kinase kinase 1
Ligand
BDBM1711
Substrate
Meas. Tech.
ChEMBL_726976 (CHEMBL1686836)
IC50
3.8±n/a nM
Citation
 Dong, QDougan, DRGong, XHalkowycz, PJin, BKanouni, TO'Connell, SMScorah, NShi, LWallace, MBZhou, F Discovery of TAK-733, a potent and selective MEK allosteric site inhibitor for the treatment of cancer. Bioorg Med Chem Lett 21:1315-9 (2011)  
Target
Name:
Dual specificity mitogen-activated protein kinase kinase 1
Synonyms:
Dual specificity mitogen-activated protein kinase (MEK) Dual specificity mitogen-activated protein kinase kinase 1 (MEK1) Dual specificity mitogen-activated protein kinase kinase MEK1/2 MAP kinase kinase 1 MAPK/ERK kinase 1 MEK-1 MP2K1_HUMAN PRKMK1 | VHL-MAP2K1/MAP2K2
Type:
Other Protein Type
Mol. Mass.:
43439.03
Organism:
Homo sapiens (Human)
Description:
Full-length human MEK-1 was generated by PCR and purified as a fusion protein from Escherichia coli lysates.
Residue:
393
  
Inhibitor
Name:
BDBM1711
Synonyms:
CHEMBL1684067 | US8470837, 8
Type:
Emp. Form.:
C18H18FIN4O4
Mol. Mass.:
500.2628
SMILES:
Cc1c(Nc2ccc(I)cc2F)c2c(ncn(C[C@@H](O)CO)c2=O)n(C)c1=O
: