Target
Dual specificity mitogen-activated protein kinase kinase 1
Ligand
BDBM1665
Substrate
Meas. Tech.
ChEMBL_726976 (CHEMBL1686836)
IC50
9.8±n/a nM
Citation
 Dong, QDougan, DRGong, XHalkowycz, PJin, BKanouni, TO'Connell, SMScorah, NShi, LWallace, MBZhou, F Discovery of TAK-733, a potent and selective MEK allosteric site inhibitor for the treatment of cancer. Bioorg Med Chem Lett 21:1315-9 (2011)  
Target
Name:
Dual specificity mitogen-activated protein kinase kinase 1
Synonyms:
Dual specificity mitogen-activated protein kinase (MEK) Dual specificity mitogen-activated protein kinase kinase 1 (MEK1) Dual specificity mitogen-activated protein kinase kinase MEK1/2 MAP kinase kinase 1 MAPK/ERK kinase 1 MEK-1 MP2K1_HUMAN PRKMK1 | VHL-MAP2K1/MAP2K2
Type:
Other Protein Type
Mol. Mass.:
43439.03
Organism:
Homo sapiens (Human)
Description:
Full-length human MEK-1 was generated by PCR and purified as a fusion protein from Escherichia coli lysates.
Residue:
393
  
Inhibitor
Name:
BDBM1665
Synonyms:
CHEMBL1684061 | US8470837, 2
Type:
Emp. Form.:
C16H14FIN4O3
Mol. Mass.:
456.2102
SMILES:
Cn1c2ncn(CCO)c(=O)c2c(Nc2ccc(I)cc2F)cc1=O
: