Target
Dual specificity mitogen-activated protein kinase kinase 1
Ligand
BDBM104963
Substrate
Meas. Tech.
ChEMBL_727517 (CHEMBL1685627)
Kd
31±n/a nM
Citation
 Isshiki, YKohchi, YIikura, HMatsubara, YAsoh, KMurata, TKohchi, MMizuguchi, ETsujii, SHattori, KMiura, TYoshimura, YAida, SMiwa, MSaitoh, RMurao, NOkabe, HBelunis, CJanson, CLukacs, CSchück, VShimma, N Design and synthesis of novel allosteric MEK inhibitor CH4987655 as an orally available anticancer agent. Bioorg Med Chem Lett 21:1795-801 (2011)  
Target
Name:
Dual specificity mitogen-activated protein kinase kinase 1
Synonyms:
Dual specificity mitogen-activated protein kinase (MEK) Dual specificity mitogen-activated protein kinase kinase 1 (MEK1) Dual specificity mitogen-activated protein kinase kinase MEK1/2 MAP kinase kinase 1 MAPK/ERK kinase 1 MEK-1 MP2K1_HUMAN PRKMK1 | VHL-MAP2K1/MAP2K2
Type:
Other Protein Type
Mol. Mass.:
43439.03
Organism:
Homo sapiens (Human)
Description:
Full-length human MEK-1 was generated by PCR and purified as a fusion protein from Escherichia coli lysates.
Residue:
393
  
Inhibitor
Name:
BDBM104963
Synonyms:
CHEMBL507361 US11701360, PD0325901 US8575391, Q
Type:
Small organic molecule
Emp. Form.:
C16H14F3IN2O4
Mol. Mass.:
482.193
SMILES:
OC[C@@H](O)CONC(=O)c1ccc(F)c(F)c1Nc1ccc(I)cc1F
: