Target
Neuromedin-K receptor
Ligand
BDBM50338380
Substrate
Meas. Tech.
ChEMBL_728272 (CHEMBL1687429)
EC50
1.8±n/a nM
Citation
 Xiong, HKang, JWoods, JMMcCauley, JPKoether, GMAlbert, JSHinkley, LLi, YGadient, RASimpson, TR Synthesis and SAR of sulfoxide substituted carboxyquinolines as NK3 receptor antagonists. Bioorg Med Chem Lett 21:1896-9 (2011)  
Target
Name:
Neuromedin-K receptor
Synonyms:
NK-3 receptor NK3R NKR Neurokinin B receptor Neuromedin-3 receptor (NK-3R) Neuromedin-K receptor Neuromedin-K receptor (NK3) TAC3R Tachykinin receptor 3 | Tachykinin receptor 3 (NK3)
Type:
Enzyme
Mol. Mass.:
52221.96
Organism:
Homo sapiens (Human)
Description:
P29371
Residue:
465
  
Inhibitor
Name:
BDBM50338380
Synonyms:
3-(methylsulfinyl)-N-((S)-1-phenylpropyl)-2-(thiophen-3-yl)quinoline-4-carboxamide | CHEMBL1682950
Type:
Small organic molecule
Emp. Form.:
C24H22N2O2S2
Mol. Mass.:
434.574
SMILES:
CC[C@H](NC(=O)c1c(c(nc2ccccc12)-c1ccsc1)S(C)=O)c1ccccc1
: