Target
Dipeptidyl peptidase 4
Ligand
BDBM50338413
Substrate
Meas. Tech.
ChEMBL_728292 (CHEMBL1687449)
IC50
57±n/a nM
Citation
 Chen, PCaldwell, CGAshton, WWu, JKHe, HLyons, KAThornberry, NAWeber, AE Synthesis and evaluation of [(1R)-1-amino-2-(2,5-difluorophenyl)ethyl]cyclohexanes and 4-[(1R)-1-amino-2-(2,5-difluorophenyl)ethyl]piperidines as DPP-4 inhibitors. Bioorg Med Chem Lett 21:1880-6 (2011)  
Target
Name:
Dipeptidyl peptidase 4
Synonyms:
ADABP Adenosine deaminase complexing protein 2 CD_antigen=CD26 DPP4 DPPIV Dipeptidyl peptidase 4 (DPP IV) Dipeptidyl peptidase 4 (DPP4) Dipeptidyl peptidase 4 membrane form Dipeptidyl peptidase IV Dipeptidyl peptidase IV (DDP-IV) Dipeptidyl peptidase IV membrane form Dipeptidyl peptidase-IV (DPP-4) T-cell activation antigen CD26 | TP103
Type:
Enzyme
Mol. Mass.:
88271.01
Organism:
Homo sapiens (Human)
Description:
P27487
Residue:
766
  
Inhibitor
Name:
BDBM50338413
Synonyms:
CHEMBL1683119 | trans-1-(4-((R)-1-amino-2-(2,5-difluorophenyl)ethyl)cyclohexyl)piperidine-3-carboxamide
Type:
Small organic molecule
Emp. Form.:
C20H29F2N3O
Mol. Mass.:
365.4606
SMILES:
N[C@H](Cc1cc(F)ccc1F)[C@H]1CC[C@@H](CC1)N1CCCC(C1)C(N)=O
: