Target
Dipeptidyl peptidase 8
Ligand
BDBM50338513
Substrate
Meas. Tech.
ChEMBL_728460 (CHEMBL1685337)
IC50
11400±n/a nM
Citation
 Andrews, KMBeebe, DABenbow, JWBoyer, DADoran, SDHui, YLiu, SMcPherson, RKNeagu, CParker, JCPiotrowski, DWSchneider, SRTreadway, JLVanVolkenberg, MAZembrowski, WJ 1-((3S,4S)-4-amino-1-(4-substituted-1,3,5-triazin-2-yl) pyrrolidin-3-yl)-5,5-difluoropiperidin-2-one inhibitors of DPP-4 for the treatment of type 2 diabetes. Bioorg Med Chem Lett 21:1810-4 (2011)  
Target
Name:
Dipeptidyl peptidase 8
Synonyms:
DPP8 DPRP-1 Dipeptidyl peptidase 8 (DPP-8) Dipeptidyl peptidase 8/9 Dipeptidyl peptidase VIII Prolyl dipeptidase DPP8
Type:
Enzyme
Mol. Mass.:
103342.62
Organism:
Homo sapiens (Human)
Description:
Q6V1X1
Residue:
898
  
Inhibitor
Name:
BDBM50338513
Synonyms:
1-((3S,4S)-4-amino-1-(6-(6-methoxypyridin-3-yl)pyrimidin-4-yl)pyrrolidin-3-yl)piperidin-2-one | CHEMBL1683566
Type:
Small organic molecule
Emp. Form.:
C19H24N6O2
Mol. Mass.:
368.4329
SMILES:
COc1ccc(cn1)-c1cc(ncn1)N1C[C@H](N)[C@H](C1)N1CCCCC1=O
: