Target
Inosine-5'-monophosphate dehydrogenase 1
Ligand
BDBM50338541
Substrate
Meas. Tech.
ChEMBL_728668 (CHEMBL1685945)
Ki
20±n/a nM
Citation
 Felczak, KChen, LWilson, DWilliams, JVince, RPetrelli, RJayaram, HNKusumanchi, PKumar, MPankiewicz, KW Cofactor-type inhibitors of inosine monophosphate dehydrogenase via modular approach: targeting the pyrophosphate binding sub-domain. Bioorg Med Chem 19:1594-605 (2011)  
Target
Name:
Inosine-5'-monophosphate dehydrogenase 1
Synonyms:
IMDH1_HUMAN IMPD 1 IMPDH-I Inosine Monophosphate Dehydrogenase Type 1 (IMPDH1) | Inosine-5'-monophosphate dehydrogenase (IMPDH)
Type:
Enzyme
Mol. Mass.:
55407.70
Organism:
Homo sapiens (Human)
Description:
Recombinant IMPDH1 expressed in E. coli.
Residue:
514
  
Inhibitor
Name:
BDBM50338541
Synonyms:
((((2S,3R,4S,5S)-5-(6-amino-9H-purin-9-yl)-3,4-dihydroxytetrahydrofuran-2-yl)methoxy)(hydroxy)phosphoryl)methyl 2-(4-hydroxy-6-methoxy-7-methyl-3-oxo-1,3-dihydroisobenzofuran-5-yl)ethyl hydrogen phosphate | CHEMBL1683743
Type:
Small organic molecule
Emp. Form.:
C23H29N5O14P2
Mol. Mass.:
661.449
SMILES:
COc1c(C)c2COC(=O)c2c(O)c1CCOP(O)(=O)OCP(O)(=O)OC[C@@H]1O[C@@H]([C@@H](O)[C@H]1O)n1cnc2c(N)ncnc12
: