Target
Vasopressin V1b receptor
Ligand
BDBM50299343
Substrate
Meas. Tech.
ChEMBL_727043 (CHEMBL1686967)
Ki
0.6±n/a nM
Citation
 Napier, SELetourneau, JJAnsari, NAuld, DSBaker, JBest, SCampbell-Wan, LChan, JHCraighead, MDesai, HGoan, KAHo, KKHulskotte, EGMacSweeney, CPMilne, RMorphy, JRNeagu, IOhlmeyer, MHPeeters, AWPresland, JRiviello, CRuigt, GSThomson, FJZanetakos, HAZhao, JWebb, ML Synthesis and SAR studies of novel 2-(4-oxo-2-aryl-quinazolin-3(4H)-yl)acetamide vasopressin V1b receptor antagonists. Bioorg Med Chem Lett 21:1871-5 (2011)  
Target
Name:
Vasopressin V1b receptor
Synonyms:
AVPR V1b AVPR1B Antidiuretic hormone receptor 1b V1bR VPR3 Vasopressin V1b receptor (V1b) Vasopressin V3 receptor
Type:
Enzyme
Mol. Mass.:
46985.01
Organism:
Homo sapiens (Human)
Description:
P47901
Residue:
424
  
Inhibitor
Name:
BDBM50299343
Synonyms:
(2S,4R)-1-((R)-5-chloro-1-(2,4-dimethoxyphenylsulfonyl)-3-(2-methoxyphenyl)-2-oxoindolin-3-yl)-4-hydroxy-N,N-dimethylpyrrolidine-2-carboxamide CHEMBL582857 SSR149415
Type:
Small organic molecule
Emp. Form.:
C30H32ClN3O8S
Mol. Mass.:
630.108
SMILES:
COc1ccc(c(OC)c1)S(=O)(=O)N1C(=O)[C@@](N2C[C@H](O)C[C@H]2C(=O)N(C)C)(c2cc(Cl)ccc12)c1ccccc1OC
: