Target
RAC-alpha serine/threonine-protein kinase
Ligand
BDBM50304368
Substrate
Meas. Tech.
ChEMBL_727296 (CHEMBL1687390)
Ki
22000±n/a nM
Citation
 Ahad, AMZuohe, SDu-Cuny, LMoses, SAZhou, LLZhang, SPowis, GMeuillet, EJMash, EA Development of sulfonamide AKT PH domain inhibitors. Bioorg Med Chem 19:2046-54 (2011)  
Target
Name:
RAC-alpha serine/threonine-protein kinase
Synonyms:
AKT1 kinase Akt PKB Protein kinase B Proto-oncogene c-Akt Rac | Thymoma viral proto-oncogene
Type:
PROTEIN
Mol. Mass.:
55700.67
Organism:
Mus musculus
Description:
ChEMBL_727296
Residue:
480
  
Inhibitor
Name:
BDBM50304368
Synonyms:
CHEMBL595582 US9320734, 101
Type:
Small organic molecule
Emp. Form.:
C18H26N4O3S2
Mol. Mass.:
410.554
SMILES:
CCCCCCCCCC(=O)Nc1ccc(cc1)S(=O)(=O)Nc1nncs1
: