Target
RAC-alpha serine/threonine-protein kinase
Ligand
BDBM50338943
Substrate
Meas. Tech.
ChEMBL_727296 (CHEMBL1687390)
Ki
9000±n/a nM
Citation
 Ahad, AMZuohe, SDu-Cuny, LMoses, SAZhou, LLZhang, SPowis, GMeuillet, EJMash, EA Development of sulfonamide AKT PH domain inhibitors. Bioorg Med Chem 19:2046-54 (2011)  
Target
Name:
RAC-alpha serine/threonine-protein kinase
Synonyms:
AKT1 kinase Akt PKB Protein kinase B Proto-oncogene c-Akt Rac | Thymoma viral proto-oncogene
Type:
PROTEIN
Mol. Mass.:
55700.67
Organism:
Mus musculus
Description:
ChEMBL_727296
Residue:
480
  
Inhibitor
Name:
BDBM50338943
Synonyms:
CHEMBL1685043 US9320734, 123E
Type:
Small organic molecule
Emp. Form.:
C21H30N4O5S2
Mol. Mass.:
482.617
SMILES:
CCCCCCCCCC(=O)Nc1ccc(cc1)S(=O)(=O)Nc1nnc(s1)C(=O)OCC
: