Target
RAC-alpha serine/threonine-protein kinase
Ligand
BDBM50338962
Substrate
Meas. Tech.
ChEMBL_727296 (CHEMBL1687390)
Ki
40000±n/a nM
Citation
 Ahad, AMZuohe, SDu-Cuny, LMoses, SAZhou, LLZhang, SPowis, GMeuillet, EJMash, EA Development of sulfonamide AKT PH domain inhibitors. Bioorg Med Chem 19:2046-54 (2011)  
Target
Name:
RAC-alpha serine/threonine-protein kinase
Synonyms:
AKT1 kinase Akt PKB Protein kinase B Proto-oncogene c-Akt Rac | Thymoma viral proto-oncogene
Type:
PROTEIN
Mol. Mass.:
55700.67
Organism:
Mus musculus
Description:
ChEMBL_727296
Residue:
480
  
Inhibitor
Name:
BDBM50338962
Synonyms:
2-(5-(Biphen-4-ylsulfonamido)-1,3,4-thiadiazol-2-yl)acetate | CHEMBL1685061
Type:
Small organic molecule
Emp. Form.:
C15H13N3O3S2
Mol. Mass.:
347.412
SMILES:
OCc1nnc(NS(=O)(=O)c2ccc(cc2)-c2ccccc2)s1
: